Information card for entry 7034856
Common name | dtbpe carbonate in manuscript |
Formula | C19 H40 Ni O3 P2 |
Calculated formula | C19 H40 Ni O3 P2 |
SMILES | [Ni]12([P](CC[P]1(C(C)(C)C)C(C)(C)C)(C(C)(C)C)C(C)(C)C)OC(=O)O2 |
Title of publication | Investigations on the catalytic carboxylation of olefins with CO2 towards α,β-unsaturated carboxylic acid salts: characterization of intermediates and ligands as well as substrate effects. |
Authors of publication | Jevtovikj, Ivana; Manzini, Simone; Hanauer, Matthias; Rominger, Frank; Schaub, Thomas |
Journal of publication | Dalton transactions (Cambridge, England : 2003) |
Year of publication | 2015 |
Journal volume | 44 |
Journal issue | 24 |
Pages of publication | 11083 - 11094 |
a | 9.988 ± 0.0009 Å |
b | 14.3032 ± 0.0012 Å |
c | 16.3855 ± 0.0013 Å |
α | 90° |
β | 106.499 ± 0.0014° |
γ | 90° |
Cell volume | 2244.5 ± 0.3 Å3 |
Cell temperature | 200 ± 2 K |
Ambient diffraction temperature | 200 ± 2 K |
Number of distinct elements | 5 |
Space group number | 14 |
Hermann-Mauguin space group symbol | P 1 21/c 1 |
Hall space group symbol | -P 2ybc |
Residual factor for all reflections | 0.0843 |
Residual factor for significantly intense reflections | 0.0496 |
Weighted residual factors for significantly intense reflections | 0.0983 |
Weighted residual factors for all reflections included in the refinement | 0.1111 |
Goodness-of-fit parameter for all reflections included in the refinement | 1.037 |
Diffraction radiation wavelength | 0.71073 Å |
Diffraction radiation type | MoKα |