Information card for entry 7034857
Formula | C116 H42 Mo N O2 P2 |
Calculated formula | C116 H42 Mo N O2 P2 |
Title of publication | Anionic coordination complexes of C60 and C70 with cyclopentadienyl and pentamethylcyclopentadienyl molybdenum dicarbonyl. |
Authors of publication | Konarev, Dmitri V.; Kuzmin, Alexey V.; Troyanov, Sergey I.; Nakano, Yoshiaki; Khasanov, Salavat S.; Otsuka, Akihiro; Yamochi, Hideki; Saito, Gunzi; Lyubovskaya, Rimma N. |
Journal of publication | Dalton transactions (Cambridge, England : 2003) |
Year of publication | 2015 |
Journal volume | 44 |
Journal issue | 20 |
Pages of publication | 9672 - 9681 |
a | 9.9787 ± 0.001 Å |
b | 41.179 ± 0.004 Å |
c | 17.2206 ± 0.0016 Å |
α | 90° |
β | 100.917 ± 0.002° |
γ | 90° |
Cell volume | 6948.1 ± 1.2 Å3 |
Cell temperature | 100 ± 2 K |
Ambient diffraction temperature | 100 ± 2 K |
Number of distinct elements | 6 |
Space group number | 14 |
Hermann-Mauguin space group symbol | P 1 21/c 1 |
Hall space group symbol | -P 2ybc |
Residual factor for all reflections | 0.1448 |
Residual factor for significantly intense reflections | 0.0666 |
Weighted residual factors for significantly intense reflections | 0.1431 |
Weighted residual factors for all reflections included in the refinement | 0.1817 |
Goodness-of-fit parameter for all reflections included in the refinement | 1.002 |
Diffraction radiation wavelength | 0.71073 Å |
Diffraction radiation type | MoKα |