Information card for entry 7034858
Formula | C121 H54 Cl2 Mo N2 O2 P2 |
Calculated formula | C121 H54 Cl2 Mo N2 O2 P2 |
Title of publication | Anionic coordination complexes of C60 and C70 with cyclopentadienyl and pentamethylcyclopentadienyl molybdenum dicarbonyl. |
Authors of publication | Konarev, Dmitri V.; Kuzmin, Alexey V.; Troyanov, Sergey I.; Nakano, Yoshiaki; Khasanov, Salavat S.; Otsuka, Akihiro; Yamochi, Hideki; Saito, Gunzi; Lyubovskaya, Rimma N. |
Journal of publication | Dalton transactions (Cambridge, England : 2003) |
Year of publication | 2015 |
Journal volume | 44 |
Journal issue | 20 |
Pages of publication | 9672 - 9681 |
a | 14.0336 ± 0.0004 Å |
b | 16.0159 ± 0.0004 Å |
c | 18.2067 ± 0.0005 Å |
α | 88.962 ± 0.002° |
β | 81.128 ± 0.002° |
γ | 78.47 ± 0.002° |
Cell volume | 3961.26 ± 0.19 Å3 |
Cell temperature | 120 ± 2 K |
Ambient diffraction temperature | 120 ± 2 K |
Number of distinct elements | 7 |
Space group number | 2 |
Hermann-Mauguin space group symbol | P -1 |
Hall space group symbol | -P 1 |
Residual factor for all reflections | 0.1717 |
Residual factor for significantly intense reflections | 0.1006 |
Weighted residual factors for significantly intense reflections | 0.2478 |
Weighted residual factors for all reflections included in the refinement | 0.2939 |
Goodness-of-fit parameter for all reflections included in the refinement | 1.021 |
Diffraction radiation wavelength | 0.71073 Å |
Diffraction radiation type | MoKα |