Information card for entry 7034914
Formula | C15 H31 Cl2 Co F6 N5 P |
Calculated formula | C15 H31 Cl2 Co F6 N5 P |
Title of publication | Synthesis, structural studies, kinetic stability, and oxidation catalysis of the late first row transition metal complexes of 4,10-dimethyl-1,4,7,10-tetraazabicyclo[6.5.2]pentadecane. |
Authors of publication | Matz, Dallas L.; Jones, Donald G.; Roewe, Kimberly D.; Gorbet, Michael-Joseph; Zhang, Zhan; Chen, Zhuqi; Prior, Timothy J.; Archibald, Stephen J.; Yin, Guochuan; Hubin, Timothy J. |
Journal of publication | Dalton transactions (Cambridge, England : 2003) |
Year of publication | 2015 |
Journal volume | 44 |
Journal issue | 27 |
Pages of publication | 12210 - 12224 |
a | 8.0397 ± 0.0008 Å |
b | 30.477 ± 0.003 Å |
c | 8.961 ± 0.0008 Å |
α | 90° |
β | 94.189 ± 0.008° |
γ | 90° |
Cell volume | 2189.8 ± 0.4 Å3 |
Cell temperature | 150 ± 2 K |
Ambient diffraction temperature | 150 ± 2 K |
Number of distinct elements | 7 |
Space group number | 14 |
Hermann-Mauguin space group symbol | P 1 21/n 1 |
Hall space group symbol | -P 2yn |
Residual factor for all reflections | 0.136 |
Residual factor for significantly intense reflections | 0.0508 |
Weighted residual factors for significantly intense reflections | 0.0951 |
Weighted residual factors for all reflections included in the refinement | 0.116 |
Goodness-of-fit parameter for all reflections included in the refinement | 0.765 |
Diffraction radiation wavelength | 0.71073 Å |
Diffraction radiation type | MoKα |