Information card for entry 7034915
Formula | C13 H32 Cl2 Cu N4 O2 |
Calculated formula | C13 H32 Cl2 Cu N4 O2 |
Title of publication | Synthesis, structural studies, kinetic stability, and oxidation catalysis of the late first row transition metal complexes of 4,10-dimethyl-1,4,7,10-tetraazabicyclo[6.5.2]pentadecane. |
Authors of publication | Matz, Dallas L.; Jones, Donald G.; Roewe, Kimberly D.; Gorbet, Michael-Joseph; Zhang, Zhan; Chen, Zhuqi; Prior, Timothy J.; Archibald, Stephen J.; Yin, Guochuan; Hubin, Timothy J. |
Journal of publication | Dalton transactions (Cambridge, England : 2003) |
Year of publication | 2015 |
Journal volume | 44 |
Journal issue | 27 |
Pages of publication | 12210 - 12224 |
a | 7.2751 ± 0.0005 Å |
b | 27.652 ± 0.002 Å |
c | 9.5242 ± 0.0007 Å |
α | 90° |
β | 106.512 ± 0.006° |
γ | 90° |
Cell volume | 1837 ± 0.2 Å3 |
Cell temperature | 150 ± 2 K |
Ambient diffraction temperature | 150 ± 2 K |
Number of distinct elements | 6 |
Space group number | 14 |
Hermann-Mauguin space group symbol | P 1 21/n 1 |
Hall space group symbol | -P 2yn |
Residual factor for all reflections | 0.0791 |
Residual factor for significantly intense reflections | 0.0629 |
Weighted residual factors for significantly intense reflections | 0.1617 |
Weighted residual factors for all reflections included in the refinement | 0.1701 |
Goodness-of-fit parameter for all reflections included in the refinement | 0.98 |
Diffraction radiation wavelength | 0.71073 Å |
Diffraction radiation type | MoKα |