Information card for entry 7034939
Chemical name | tris(pentafluorophenyl)[2-thiophen-2-ylpyridine-κ<i>N</i>]gold(III) |
Formula | C27 H7 Au F15 N S |
Calculated formula | C27 H7 Au F15 N S |
Title of publication | Stable and color tunable emission properties based on non-cyclometalated gold(iii) complexes. |
Authors of publication | Bachmann, Michael; Blacque, Olivier; Venkatesan, Koushik |
Journal of publication | Dalton transactions (Cambridge, England : 2003) |
Year of publication | 2015 |
Journal volume | 44 |
Journal issue | 21 |
Pages of publication | 10003 - 10013 |
a | 7.9119 ± 0.0002 Å |
b | 18.0726 ± 0.0004 Å |
c | 18.4278 ± 0.0004 Å |
α | 90° |
β | 97.163 ± 0.002° |
γ | 90° |
Cell volume | 2614.4 ± 0.11 Å3 |
Cell temperature | 183 ± 1 K |
Ambient diffraction temperature | 183 ± 1 K |
Number of distinct elements | 6 |
Space group number | 14 |
Hermann-Mauguin space group symbol | P 1 21/c 1 |
Hall space group symbol | -P 2ybc |
Residual factor for all reflections | 0.0241 |
Residual factor for significantly intense reflections | 0.0218 |
Weighted residual factors for significantly intense reflections | 0.0536 |
Weighted residual factors for all reflections included in the refinement | 0.0549 |
Goodness-of-fit parameter for all reflections included in the refinement | 1.039 |
Diffraction radiation wavelength | 0.71073 Å |
Diffraction radiation type | MoKα |