Information card for entry 7034951
Formula | C20 H20 Gd N O9 |
Calculated formula | C20 H20 Gd N O9 |
Title of publication | Three sra topological lanthanide-organic frameworks built from 2,2'-dimethoxy-4,4'-biphenyldicarboxylic acid. |
Authors of publication | Wang, Xin; Zhao, Jie; Zhao, Yan; Xu, Heng; Shen, Xuan; Zhu, Dun-Ru; Jing, Su |
Journal of publication | Dalton transactions (Cambridge, England : 2003) |
Year of publication | 2015 |
Journal volume | 44 |
Journal issue | 19 |
Pages of publication | 9281 - 9288 |
a | 28.017 ± 0.003 Å |
b | 9.6175 ± 0.0009 Å |
c | 8.2586 ± 0.0007 Å |
α | 90° |
β | 90° |
γ | 90° |
Cell volume | 2225.3 ± 0.4 Å3 |
Cell temperature | 296 ± 2 K |
Ambient diffraction temperature | 296 ± 2 K |
Number of distinct elements | 5 |
Space group number | 33 |
Hermann-Mauguin space group symbol | P n a 21 |
Hall space group symbol | P 2c -2n |
Residual factor for all reflections | 0.0244 |
Residual factor for significantly intense reflections | 0.0207 |
Weighted residual factors for significantly intense reflections | 0.0418 |
Weighted residual factors for all reflections included in the refinement | 0.0431 |
Goodness-of-fit parameter for all reflections included in the refinement | 1.045 |
Diffraction radiation wavelength | 0.71073 Å |
Diffraction radiation type | MoKα |