Information card for entry 7034952
Formula | C20 H20 Dy N O9 |
Calculated formula | C20 H20 Dy N O9 |
Title of publication | Three sra topological lanthanide-organic frameworks built from 2,2'-dimethoxy-4,4'-biphenyldicarboxylic acid. |
Authors of publication | Wang, Xin; Zhao, Jie; Zhao, Yan; Xu, Heng; Shen, Xuan; Zhu, Dun-Ru; Jing, Su |
Journal of publication | Dalton transactions (Cambridge, England : 2003) |
Year of publication | 2015 |
Journal volume | 44 |
Journal issue | 19 |
Pages of publication | 9281 - 9288 |
a | 27.951 ± 0.004 Å |
b | 9.6124 ± 0.0013 Å |
c | 8.1937 ± 0.0011 Å |
α | 90° |
β | 90° |
γ | 90° |
Cell volume | 2201.5 ± 0.5 Å3 |
Cell temperature | 296 ± 2 K |
Ambient diffraction temperature | 296 ± 2 K |
Number of distinct elements | 5 |
Space group number | 33 |
Hermann-Mauguin space group symbol | P n a 21 |
Hall space group symbol | P 2c -2n |
Residual factor for all reflections | 0.0339 |
Residual factor for significantly intense reflections | 0.0251 |
Weighted residual factors for significantly intense reflections | 0.0494 |
Weighted residual factors for all reflections included in the refinement | 0.0521 |
Goodness-of-fit parameter for all reflections included in the refinement | 1.006 |
Diffraction radiation wavelength | 0.71073 Å |
Diffraction radiation type | MoKα |