Information card for entry 7034954
Formula | C30 H49 N3 O0 P3 Rh |
Calculated formula | C30 H49 N3 P2 Rh |
Title of publication | C-H and H-H bond activation via ligand dearomatization/rearomatization of a PN(3)P-rhodium(i) complex. |
Authors of publication | Wang, Yuan; Zheng, Bin; Pan, Yupeng; Pan, Chengling; He, Lipeng; Huang, Kuo-Wei |
Journal of publication | Dalton transactions (Cambridge, England : 2003) |
Year of publication | 2015 |
Journal volume | 44 |
Journal issue | 34 |
Pages of publication | 15111 - 15115 |
a | 18.9974 ± 0.0002 Å |
b | 8.2894 ± 0.0001 Å |
c | 19.8778 ± 0.0002 Å |
α | 90° |
β | 91.361 ± 0.001° |
γ | 90° |
Cell volume | 3129.41 ± 0.06 Å3 |
Cell temperature | 293 ± 2 K |
Ambient diffraction temperature | 293 ± 2 K |
Number of distinct elements | 6 |
Space group number | 14 |
Hermann-Mauguin space group symbol | P 1 21/c 1 |
Hall space group symbol | -P 2ybc |
Residual factor for all reflections | 0.0337 |
Residual factor for significantly intense reflections | 0.03 |
Weighted residual factors for significantly intense reflections | 0.0797 |
Weighted residual factors for all reflections included in the refinement | 0.0881 |
Goodness-of-fit parameter for all reflections included in the refinement | 0.994 |
Diffraction radiation wavelength | 1.54178 Å |
Diffraction radiation type | CuKα |