Information card for entry 7034953
Formula | C25 H49 Cl N3 O P2 Rh |
Calculated formula | C25 H49 Cl N3 O P2 Rh |
SMILES | [Rh]12(Cl)[P](Nc3[n]2c(N[P]1(C(C)(C)C)C(C)(C)C)ccc3)(C(C)(C)C)C(C)(C)C.C1CCCO1 |
Title of publication | C-H and H-H bond activation via ligand dearomatization/rearomatization of a PN(3)P-rhodium(i) complex. |
Authors of publication | Wang, Yuan; Zheng, Bin; Pan, Yupeng; Pan, Chengling; He, Lipeng; Huang, Kuo-Wei |
Journal of publication | Dalton transactions (Cambridge, England : 2003) |
Year of publication | 2015 |
Journal volume | 44 |
Journal issue | 34 |
Pages of publication | 15111 - 15115 |
a | 15.4568 ± 0.0012 Å |
b | 15.5903 ± 0.0008 Å |
c | 16.3952 ± 0.0011 Å |
α | 90° |
β | 90° |
γ | 90° |
Cell volume | 3950.9 ± 0.5 Å3 |
Cell temperature | 173 ± 2 K |
Ambient diffraction temperature | 173 ± 2 K |
Number of distinct elements | 7 |
Space group number | 19 |
Hermann-Mauguin space group symbol | P 21 21 21 |
Hall space group symbol | P 2ac 2ab |
Residual factor for all reflections | 0.0625 |
Residual factor for significantly intense reflections | 0.0447 |
Weighted residual factors for significantly intense reflections | 0.1065 |
Weighted residual factors for all reflections included in the refinement | 0.1171 |
Goodness-of-fit parameter for all reflections included in the refinement | 0.974 |
Diffraction radiation wavelength | 0.71073 Å |
Diffraction radiation type | MoKα |