Information card for entry 7034968
Formula | C26 H36 O4 Sn |
Calculated formula | C26 H36 O4 Sn |
Title of publication | Organotin(iv) based anti-HCV drugs: synthesis, characterization and biochemical activity. |
Authors of publication | Shah, Farooq Ali; Sabir, Shaista; Fatima, Kaneez; Ali, Saqib; Qadri, Ishtiaq; Rizzoli, Corrado |
Journal of publication | Dalton transactions (Cambridge, England : 2003) |
Year of publication | 2015 |
Journal volume | 44 |
Journal issue | 22 |
Pages of publication | 10467 - 10478 |
a | 9.566 ± 0.003 Å |
b | 11.892 ± 0.005 Å |
c | 13.438 ± 0.005 Å |
α | 104.257 ± 0.006° |
β | 99.468 ± 0.006° |
γ | 109.702 ± 0.008° |
Cell volume | 1342.6 ± 0.9 Å3 |
Cell temperature | 295 ± 2 K |
Ambient diffraction temperature | 295 ± 2 K |
Number of distinct elements | 4 |
Space group number | 2 |
Hermann-Mauguin space group symbol | P -1 |
Hall space group symbol | -P 1 |
Residual factor for all reflections | 0.0618 |
Residual factor for significantly intense reflections | 0.0423 |
Weighted residual factors for significantly intense reflections | 0.1058 |
Weighted residual factors for all reflections included in the refinement | 0.1126 |
Goodness-of-fit parameter for all reflections included in the refinement | 0.97 |
Diffraction radiation wavelength | 0.71073 Å |
Diffraction radiation type | MoKα |