Information card for entry 7034969
Formula | C24 H36 O4 Sn2 |
Calculated formula | C24 H36 O4 Sn2 |
SMILES | [Sn]([O]=C(O[Sn](C)(C)C)c1cc(cc(c1)C)C)(OC(=O)c1cc(cc(c1)C)C)(C)(C)C |
Title of publication | Organotin(iv) based anti-HCV drugs: synthesis, characterization and biochemical activity. |
Authors of publication | Shah, Farooq Ali; Sabir, Shaista; Fatima, Kaneez; Ali, Saqib; Qadri, Ishtiaq; Rizzoli, Corrado |
Journal of publication | Dalton transactions (Cambridge, England : 2003) |
Year of publication | 2015 |
Journal volume | 44 |
Journal issue | 22 |
Pages of publication | 10467 - 10478 |
a | 12.041 ± 0.003 Å |
b | 11.466 ± 0.003 Å |
c | 20.435 ± 0.005 Å |
α | 90° |
β | 99.367 ± 0.004° |
γ | 90° |
Cell volume | 2783.7 ± 1.2 Å3 |
Cell temperature | 294 ± 2 K |
Ambient diffraction temperature | 294 ± 2 K |
Number of distinct elements | 4 |
Space group number | 14 |
Hermann-Mauguin space group symbol | P 1 21/c 1 |
Hall space group symbol | -P 2ybc |
Residual factor for all reflections | 0.0876 |
Residual factor for significantly intense reflections | 0.0335 |
Weighted residual factors for significantly intense reflections | 0.0666 |
Weighted residual factors for all reflections included in the refinement | 0.0817 |
Goodness-of-fit parameter for all reflections included in the refinement | 0.938 |
Diffraction radiation wavelength | 0.71073 Å |
Diffraction radiation type | MoKα |