Information card for entry 7034970
Formula | C13.15 H19.6 Cl Cu N6 O0.15 S |
Calculated formula | C13.15 H19.6 Cl Cu N6 O0.15 S |
Title of publication | Strong effect of copper(ii) coordination on antiproliferative activity of thiosemicarbazone-piperazine and thiosemicarbazone-morpholine hybrids. |
Authors of publication | Bacher, Felix; Dömötör, Orsolya; Chugunova, Anastasia; Nagy, Nóra V; Filipović, Lana; Radulović, Siniša; Enyedy, Éva A; Arion, Vladimir B. |
Journal of publication | Dalton transactions (Cambridge, England : 2003) |
Year of publication | 2015 |
Journal volume | 44 |
Journal issue | 19 |
Pages of publication | 9071 - 9090 |
a | 7.6944 ± 0.0005 Å |
b | 17.4966 ± 0.001 Å |
c | 13.1409 ± 0.0008 Å |
α | 90° |
β | 102.615 ± 0.002° |
γ | 90° |
Cell volume | 1726.4 ± 0.18 Å3 |
Cell temperature | 100 ± 2 K |
Ambient diffraction temperature | 100 ± 2 K |
Number of distinct elements | 7 |
Space group number | 14 |
Hermann-Mauguin space group symbol | P 1 21/n 1 |
Hall space group symbol | -P 2yn |
Residual factor for all reflections | 0.0428 |
Residual factor for significantly intense reflections | 0.0334 |
Weighted residual factors for significantly intense reflections | 0.0723 |
Weighted residual factors for all reflections included in the refinement | 0.0753 |
Goodness-of-fit parameter for all reflections included in the refinement | 1.079 |
Diffraction radiation wavelength | 0.71073 Å |
Diffraction radiation type | MoKα |