Information card for entry 7035016
Formula | C80.98 H62.08 Mn6 N11.15 O46.17 |
Calculated formula | C81.065 H62.105 Mn6 N11.21 O46.145 |
Title of publication | Synthesis of mixed-valence hexanuclear Mn(ii/iii) clusters from its Mn(ii) precursor: variations of catecholase-like activity and magnetic coupling. |
Authors of publication | Kar, Paramita; Ida, Yumi; Kanetomo, Takuya; Drew, Michael G. B.; Ishida, Takayuki; Ghosh, Ashutosh |
Journal of publication | Dalton transactions (Cambridge, England : 2003) |
Year of publication | 2015 |
Journal volume | 44 |
Journal issue | 21 |
Pages of publication | 9795 - 9804 |
a | 22.618 ± 0.005 Å |
b | 27.352 ± 0.005 Å |
c | 30.83 ± 0.005 Å |
α | 90° |
β | 90° |
γ | 90° |
Cell volume | 19073 ± 6 Å3 |
Cell temperature | 293 ± 2 K |
Ambient diffraction temperature | 293 ± 2 K |
Number of distinct elements | 5 |
Space group number | 61 |
Hermann-Mauguin space group symbol | P b c a |
Hall space group symbol | -P 2ac 2ab |
Residual factor for all reflections | 0.1096 |
Residual factor for significantly intense reflections | 0.0574 |
Weighted residual factors for significantly intense reflections | 0.1282 |
Weighted residual factors for all reflections included in the refinement | 0.1555 |
Goodness-of-fit parameter for all reflections included in the refinement | 1.089 |
Diffraction radiation wavelength | 0.71073 Å |
Diffraction radiation type | MoKα |