Information card for entry 7035017
Formula | C78.45 H52.23 Mn6 N14.23 O42 |
Calculated formula | C78.454 H52.227 Mn6 N14.227 O42 |
Title of publication | Synthesis of mixed-valence hexanuclear Mn(ii/iii) clusters from its Mn(ii) precursor: variations of catecholase-like activity and magnetic coupling. |
Authors of publication | Kar, Paramita; Ida, Yumi; Kanetomo, Takuya; Drew, Michael G. B.; Ishida, Takayuki; Ghosh, Ashutosh |
Journal of publication | Dalton transactions (Cambridge, England : 2003) |
Year of publication | 2015 |
Journal volume | 44 |
Journal issue | 21 |
Pages of publication | 9795 - 9804 |
a | 13.408 ± 0.005 Å |
b | 27.548 ± 0.005 Å |
c | 24.733 ± 0.005 Å |
α | 90° |
β | 99.406 ± 0.005° |
γ | 90° |
Cell volume | 9013 ± 4 Å3 |
Cell temperature | 293 ± 2 K |
Ambient diffraction temperature | 293 ± 2 K |
Number of distinct elements | 5 |
Space group number | 14 |
Hermann-Mauguin space group symbol | P 1 21/n 1 |
Hall space group symbol | -P 2yn |
Residual factor for all reflections | 0.0661 |
Residual factor for significantly intense reflections | 0.0442 |
Weighted residual factors for significantly intense reflections | 0.1049 |
Weighted residual factors for all reflections included in the refinement | 0.1178 |
Goodness-of-fit parameter for all reflections included in the refinement | 0.979 |
Diffraction radiation wavelength | 0.71073 Å |
Diffraction radiation type | MoKα |