Information card for entry 7035019
Formula | C31 H45 N3 Ni O2 |
Calculated formula | C31 H45 N3 Ni O2 |
Title of publication | Large and negative magnetic anisotropy in pentacoordinate mononuclear Ni(ii) Schiff base complexes. |
Authors of publication | Nemec, Ivan; Herchel, Radovan; Svoboda, Ingrid; Boča, Roman; Trávníček, Zdeněk |
Journal of publication | Dalton transactions (Cambridge, England : 2003) |
Year of publication | 2015 |
Journal volume | 44 |
Journal issue | 20 |
Pages of publication | 9551 - 9560 |
a | 13.632 ± 0.001 Å |
b | 17.918 ± 0.001 Å |
c | 12.647 ± 0.001 Å |
α | 90° |
β | 99.475 ± 0.007° |
γ | 90° |
Cell volume | 3047 ± 0.4 Å3 |
Cell temperature | 303 ± 2 K |
Ambient diffraction temperature | 303 ± 2 K |
Number of distinct elements | 5 |
Space group number | 14 |
Hermann-Mauguin space group symbol | P 1 21/c 1 |
Hall space group symbol | -P 2ybc |
Residual factor for all reflections | 0.0946 |
Residual factor for significantly intense reflections | 0.0453 |
Weighted residual factors for significantly intense reflections | 0.0988 |
Weighted residual factors for all reflections included in the refinement | 0.1132 |
Goodness-of-fit parameter for all reflections included in the refinement | 0.968 |
Diffraction radiation wavelength | 0.71073 Å |
Diffraction radiation type | MoKα |