Information card for entry 7035018
Formula | C30 H22 N4 O4 Zn |
Calculated formula | C30 H22 N4 O4 Zn |
Title of publication | Graphene oxide coated coordination polymer nanobelt composite material: a new type of visible light active and highly efficient photocatalyst for Cr(vi) reduction. |
Authors of publication | Shi, Gui-Mei; Zhang, Bin; Xu, Xin-Xin; Fu, Yan-Hong |
Journal of publication | Dalton transactions (Cambridge, England : 2003) |
Year of publication | 2015 |
Journal volume | 44 |
Journal issue | 24 |
Pages of publication | 11155 - 11164 |
a | 15.1755 ± 0.0011 Å |
b | 22.2665 ± 0.0017 Å |
c | 8.1466 ± 0.0006 Å |
α | 90° |
β | 110.282 ± 0.001° |
γ | 90° |
Cell volume | 2582.1 ± 0.3 Å3 |
Cell temperature | 273 ± 2 K |
Ambient diffraction temperature | 273 ± 2 K |
Number of distinct elements | 5 |
Space group number | 9 |
Hermann-Mauguin space group symbol | C 1 c 1 |
Hall space group symbol | C -2yc |
Residual factor for all reflections | 0.0694 |
Residual factor for significantly intense reflections | 0.0511 |
Weighted residual factors for significantly intense reflections | 0.1101 |
Weighted residual factors for all reflections included in the refinement | 0.122 |
Goodness-of-fit parameter for all reflections included in the refinement | 1.072 |
Diffraction radiation wavelength | 0.71073 Å |
Diffraction radiation type | MoKα |