Information card for entry 7035021
Formula | C21 H23 I2 N3 Ni O2 |
Calculated formula | C21 H23 I2 N3 Ni O2 |
Title of publication | Large and negative magnetic anisotropy in pentacoordinate mononuclear Ni(ii) Schiff base complexes. |
Authors of publication | Nemec, Ivan; Herchel, Radovan; Svoboda, Ingrid; Boča, Roman; Trávníček, Zdeněk |
Journal of publication | Dalton transactions (Cambridge, England : 2003) |
Year of publication | 2015 |
Journal volume | 44 |
Journal issue | 20 |
Pages of publication | 9551 - 9560 |
a | 10.3149 ± 0.0006 Å |
b | 27.6223 ± 0.0012 Å |
c | 8.446 ± 0.0005 Å |
α | 90° |
β | 113.807 ± 0.007° |
γ | 90° |
Cell volume | 2201.7 ± 0.2 Å3 |
Cell temperature | 130 ± 2 K |
Ambient diffraction temperature | 130 ± 2 K |
Number of distinct elements | 6 |
Space group number | 14 |
Hermann-Mauguin space group symbol | P 1 21/c 1 |
Hall space group symbol | -P 2ybc |
Residual factor for all reflections | 0.0362 |
Residual factor for significantly intense reflections | 0.0279 |
Weighted residual factors for significantly intense reflections | 0.0615 |
Weighted residual factors for all reflections included in the refinement | 0.0634 |
Goodness-of-fit parameter for all reflections included in the refinement | 1.007 |
Diffraction radiation wavelength | 0.71073 Å |
Diffraction radiation type | MoKα |