Information card for entry 7035022
Formula | C21 H25 N3 Ni O2 |
Calculated formula | C21 H25 N3 Ni O2 |
Title of publication | Large and negative magnetic anisotropy in pentacoordinate mononuclear Ni(ii) Schiff base complexes. |
Authors of publication | Nemec, Ivan; Herchel, Radovan; Svoboda, Ingrid; Boča, Roman; Trávníček, Zdeněk |
Journal of publication | Dalton transactions (Cambridge, England : 2003) |
Year of publication | 2015 |
Journal volume | 44 |
Journal issue | 20 |
Pages of publication | 9551 - 9560 |
a | 6.949 ± 0.0008 Å |
b | 14.037 ± 0.002 Å |
c | 20.113 ± 0.005 Å |
α | 90° |
β | 92.008 ± 0.013° |
γ | 90° |
Cell volume | 1960.7 ± 0.6 Å3 |
Cell temperature | 293 ± 2 K |
Ambient diffraction temperature | 293 ± 2 K |
Number of distinct elements | 5 |
Space group number | 14 |
Hermann-Mauguin space group symbol | P 1 21/c 1 |
Hall space group symbol | -P 2ybc |
Residual factor for all reflections | 0.1075 |
Residual factor for significantly intense reflections | 0.0552 |
Weighted residual factors for significantly intense reflections | 0.1235 |
Weighted residual factors for all reflections included in the refinement | 0.1378 |
Goodness-of-fit parameter for all reflections included in the refinement | 0.88 |
Diffraction radiation wavelength | 0.71073 Å |
Diffraction radiation type | MoKα |