Information card for entry 7035142
Formula | C10 H18 Cd Cl0 N6 O0 S4 |
Calculated formula | C10 H16 Cd N6 S4 |
Title of publication | New organically templated thiocyanatocadmates and chlorocuprate(ii): synthesis and structural characterization. |
Authors of publication | Guo, Bing; Zhang, Xiao; Yu, Jie-Hui; Xu, Ji-Qing |
Journal of publication | Dalton transactions (Cambridge, England : 2003) |
Year of publication | 2015 |
Journal volume | 44 |
Journal issue | 25 |
Pages of publication | 11470 - 11481 |
a | 5.9229 ± 0.0012 Å |
b | 8.1307 ± 0.0016 Å |
c | 10.051 ± 0.002 Å |
α | 107.23 ± 0.03° |
β | 97.19 ± 0.03° |
γ | 93.76 ± 0.03° |
Cell volume | 455.97 ± 0.18 Å3 |
Cell temperature | 293 ± 2 K |
Ambient diffraction temperature | 293 ± 2 K |
Number of distinct elements | 7 |
Space group number | 2 |
Hermann-Mauguin space group symbol | P -1 |
Hall space group symbol | -P 1 |
Residual factor for all reflections | 0.0687 |
Residual factor for significantly intense reflections | 0.055 |
Weighted residual factors for significantly intense reflections | 0.1448 |
Weighted residual factors for all reflections included in the refinement | 0.2145 |
Goodness-of-fit parameter for all reflections included in the refinement | 1.07 |
Diffraction radiation wavelength | 0.71073 Å |
Diffraction radiation type | MoKα |