Information card for entry 7035143
Formula | C14 H22 Cd2 N8 O0 S6 |
Calculated formula | C14 H22 Cd2 N8 S6 |
Title of publication | New organically templated thiocyanatocadmates and chlorocuprate(ii): synthesis and structural characterization. |
Authors of publication | Guo, Bing; Zhang, Xiao; Yu, Jie-Hui; Xu, Ji-Qing |
Journal of publication | Dalton transactions (Cambridge, England : 2003) |
Year of publication | 2015 |
Journal volume | 44 |
Journal issue | 25 |
Pages of publication | 11470 - 11481 |
a | 5.9186 ± 0.0012 Å |
b | 10.709 ± 0.002 Å |
c | 10.863 ± 0.002 Å |
α | 73.96 ± 0.03° |
β | 76.92 ± 0.03° |
γ | 81.3 ± 0.03° |
Cell volume | 641.6 ± 0.2 Å3 |
Cell temperature | 293 ± 2 K |
Ambient diffraction temperature | 293 ± 2 K |
Number of distinct elements | 6 |
Space group number | 2 |
Hermann-Mauguin space group symbol | P -1 |
Hall space group symbol | -P 1 |
Residual factor for all reflections | 0.0365 |
Residual factor for significantly intense reflections | 0.0339 |
Weighted residual factors for significantly intense reflections | 0.1058 |
Weighted residual factors for all reflections included in the refinement | 0.1123 |
Goodness-of-fit parameter for all reflections included in the refinement | 1.147 |
Diffraction radiation wavelength | 0.71073 Å |
Diffraction radiation type | MoKα |