Information card for entry 7035173
Formula | C70 H59 Br8 N13 Ni2 O6 Re2 |
Calculated formula | C70 H59 Br8 N13 Ni2 O6 Re2 |
Title of publication | The crystal structure and magnetic properties of 3-pyridinecarboxylate-bridged Re(ii)M(ii) complexes (M = Cu, Ni, Co and Mn). |
Authors of publication | Pacheco, Mario; Cuevas, Alicia; González-Platas, Javier; Lloret, Francesc; Julve, Miguel; Kremer, Carlos |
Journal of publication | Dalton transactions (Cambridge, England : 2003) |
Year of publication | 2015 |
Journal volume | 44 |
Journal issue | 25 |
Pages of publication | 11636 - 11648 |
a | 11.7486 ± 0.0001 Å |
b | 19.72731 ± 0.00014 Å |
c | 18.11565 ± 0.00014 Å |
α | 90° |
β | 108.273 ± 0.0009° |
γ | 90° |
Cell volume | 3986.91 ± 0.06 Å3 |
Cell temperature | 293 ± 2 K |
Ambient diffraction temperature | 293 ± 2 K |
Number of distinct elements | 7 |
Space group number | 14 |
Hermann-Mauguin space group symbol | P 1 21/n 1 |
Hall space group symbol | -P 2yn |
Residual factor for all reflections | 0.0334 |
Residual factor for significantly intense reflections | 0.0322 |
Weighted residual factors for significantly intense reflections | 0.0842 |
Weighted residual factors for all reflections included in the refinement | 0.0851 |
Goodness-of-fit parameter for all reflections included in the refinement | 1.122 |
Diffraction radiation probe | x-ray |
Diffraction radiation wavelength | 1.54184 Å |
Diffraction radiation type | CuKα |