Information card for entry 7035174
Formula | C69 H60 Br8 Co2 N12 O7 Re2 |
Calculated formula | C69 H60 Br8 Co2 N12 O7 Re2 |
Title of publication | The crystal structure and magnetic properties of 3-pyridinecarboxylate-bridged Re(ii)M(ii) complexes (M = Cu, Ni, Co and Mn). |
Authors of publication | Pacheco, Mario; Cuevas, Alicia; González-Platas, Javier; Lloret, Francesc; Julve, Miguel; Kremer, Carlos |
Journal of publication | Dalton transactions (Cambridge, England : 2003) |
Year of publication | 2015 |
Journal volume | 44 |
Journal issue | 25 |
Pages of publication | 11636 - 11648 |
a | 11.7505 ± 0.0002 Å |
b | 19.9118 ± 0.0003 Å |
c | 18.0279 ± 0.0004 Å |
α | 90° |
β | 107.768 ± 0.002° |
γ | 90° |
Cell volume | 4016.85 ± 0.14 Å3 |
Cell temperature | 293 ± 2 K |
Ambient diffraction temperature | 293 ± 2 K |
Number of distinct elements | 7 |
Space group number | 14 |
Hermann-Mauguin space group symbol | P 1 21/n 1 |
Hall space group symbol | -P 2yn |
Residual factor for all reflections | 0.0501 |
Residual factor for significantly intense reflections | 0.045 |
Weighted residual factors for significantly intense reflections | 0.116 |
Weighted residual factors for all reflections included in the refinement | 0.1194 |
Goodness-of-fit parameter for all reflections included in the refinement | 1.052 |
Diffraction radiation probe | x-ray |
Diffraction radiation wavelength | 1.54184 Å |
Diffraction radiation type | CuKα |