Information card for entry 7035182
Formula | C14 H18 N2 O8 U |
Calculated formula | C14 H18 N2 O8 U |
Title of publication | A family of uranyl-aromatic dicarboxylate (pht-, ipa-, tpa-) framework hybrid materials: photoluminescence, surface photovoltage and dye adsorption. |
Authors of publication | Gao, Xue; Wang, Che; Shi, Zhong-Feng; Song, Jian; Bai, Feng-Ying; Wang, Ji-Xiao; Xing, Yong-Heng |
Journal of publication | Dalton transactions (Cambridge, England : 2003) |
Year of publication | 2015 |
Journal volume | 44 |
Journal issue | 25 |
Pages of publication | 11562 - 11571 |
a | 6.5012 ± 0.001 Å |
b | 9.5533 ± 0.0014 Å |
c | 14.649 ± 0.002 Å |
α | 90° |
β | 95.927 ± 0.002° |
γ | 90° |
Cell volume | 905 ± 0.2 Å3 |
Cell temperature | 296 ± 2 K |
Ambient diffraction temperature | 296 ± 2 K |
Number of distinct elements | 5 |
Space group number | 14 |
Hermann-Mauguin space group symbol | P 1 21/n 1 |
Hall space group symbol | -P 2yn |
Residual factor for all reflections | 0.0332 |
Residual factor for significantly intense reflections | 0.022 |
Weighted residual factors for significantly intense reflections | 0.0503 |
Weighted residual factors for all reflections included in the refinement | 0.053 |
Goodness-of-fit parameter for all reflections included in the refinement | 1.024 |
Diffraction radiation wavelength | 0.71073 Å |
Diffraction radiation type | MoKα |