Information card for entry 7035183
Formula | C14 H10 O6 U |
Calculated formula | C14 H10 O6 U |
Title of publication | A family of uranyl-aromatic dicarboxylate (pht-, ipa-, tpa-) framework hybrid materials: photoluminescence, surface photovoltage and dye adsorption. |
Authors of publication | Gao, Xue; Wang, Che; Shi, Zhong-Feng; Song, Jian; Bai, Feng-Ying; Wang, Ji-Xiao; Xing, Yong-Heng |
Journal of publication | Dalton transactions (Cambridge, England : 2003) |
Year of publication | 2015 |
Journal volume | 44 |
Journal issue | 25 |
Pages of publication | 11562 - 11571 |
a | 7.6328 ± 0.0012 Å |
b | 17.461 ± 0.003 Å |
c | 5.3032 ± 0.0008 Å |
α | 90° |
β | 95.692 ± 0.002° |
γ | 90° |
Cell volume | 703.3 ± 0.2 Å3 |
Cell temperature | 296 ± 2 K |
Ambient diffraction temperature | 296 ± 2 K |
Number of distinct elements | 4 |
Space group number | 12 |
Hermann-Mauguin space group symbol | C 1 2/m 1 |
Hall space group symbol | -C 2y |
Residual factor for all reflections | 0.0259 |
Residual factor for significantly intense reflections | 0.0259 |
Weighted residual factors for significantly intense reflections | 0.066 |
Weighted residual factors for all reflections included in the refinement | 0.066 |
Goodness-of-fit parameter for all reflections included in the refinement | 1.17 |
Diffraction radiation wavelength | 0.71073 Å |
Diffraction radiation type | MoKα |