Information card for entry 7035197
Formula | C30 H31 F12 N13 O12 S4 |
Calculated formula | C30 H31 F12 N13 O12 S4 |
Title of publication | Introducing a pyrazole/imidazole based hybrid cyclophane: a hydrogen bond sensor and binucleating ligand precursor. |
Authors of publication | Altmann, Philipp J.; Jandl, Christian; Pöthig, Alexander |
Journal of publication | Dalton transactions (Cambridge, England : 2003) |
Year of publication | 2015 |
Journal volume | 44 |
Journal issue | 25 |
Pages of publication | 11278 - 11281 |
a | 21.1486 ± 0.0012 Å |
b | 12.7425 ± 0.0007 Å |
c | 18.4902 ± 0.001 Å |
α | 90° |
β | 114.813 ± 0.002° |
γ | 90° |
Cell volume | 4522.8 ± 0.4 Å3 |
Cell temperature | 123 K |
Ambient diffraction temperature | 123 K |
Number of distinct elements | 6 |
Space group number | 14 |
Hermann-Mauguin space group symbol | P 1 21/c 1 |
Hall space group symbol | -P 2ybc |
Residual factor for all reflections | 0.0577 |
Residual factor for significantly intense reflections | 0.0487 |
Weighted residual factors for significantly intense reflections | 0.1226 |
Weighted residual factors for all reflections included in the refinement | 0.13 |
Goodness-of-fit parameter for all reflections included in the refinement | 1.033 |
Diffraction radiation probe | x-ray |
Diffraction radiation wavelength | 0.71073 Å |
Diffraction radiation type | MoKα |