Information card for entry 7035198
Formula | C30 H37 F24 N15 P4 |
Calculated formula | C30 H37 F24 N15 P4 |
Title of publication | Introducing a pyrazole/imidazole based hybrid cyclophane: a hydrogen bond sensor and binucleating ligand precursor. |
Authors of publication | Altmann, Philipp J.; Jandl, Christian; Pöthig, Alexander |
Journal of publication | Dalton transactions (Cambridge, England : 2003) |
Year of publication | 2015 |
Journal volume | 44 |
Journal issue | 25 |
Pages of publication | 11278 - 11281 |
a | 17.748 ± 0.002 Å |
b | 14.432 ± 0.002 Å |
c | 17.585 ± 0.002 Å |
α | 90° |
β | 90° |
γ | 90° |
Cell volume | 4504.2 ± 1 Å3 |
Cell temperature | 123 K |
Ambient diffraction temperature | 123 K |
Number of distinct elements | 5 |
Space group number | 62 |
Hermann-Mauguin space group symbol | P n m a |
Hall space group symbol | -P 2ac 2n |
Residual factor for all reflections | 0.0558 |
Residual factor for significantly intense reflections | 0.0484 |
Weighted residual factors for significantly intense reflections | 0.13 |
Weighted residual factors for all reflections included in the refinement | 0.136 |
Goodness-of-fit parameter for all reflections included in the refinement | 1.057 |
Diffraction radiation probe | x-ray |
Diffraction radiation wavelength | 0.71073 Å |
Diffraction radiation type | MoKα |