Information card for entry 7035236
Formula | C53 H61 Mg N3 O Si2 |
Calculated formula | C53 H61 Mg N3 O Si2 |
SMILES | [Mg]12([N](=Cc3c(O2)c(cc(c3)C(c2ccccc2)(C)C)C(c2ccccc2)(C)C)c2ccc3ccccc3c2c2c3ccccc3ccc2[N]1(C)C)N([Si](C)(C)C)[Si](C)(C)C |
Title of publication | Ring-opening polymerization of rac-lactide and α-methyltrimethylene carbonate catalyzed by magnesium and zinc complexes derived from binaphthyl-based iminophenolate ligands. |
Authors of publication | Huang, Miao; Pan, Chen; Ma, Haiyan |
Journal of publication | Dalton transactions (Cambridge, England : 2003) |
Year of publication | 2015 |
Journal volume | 44 |
Journal issue | 27 |
Pages of publication | 12420 - 12431 |
a | 13.584 ± 0.009 Å |
b | 14.016 ± 0.009 Å |
c | 26.244 ± 0.019 Å |
α | 90° |
β | 99.684 ± 0.012° |
γ | 90° |
Cell volume | 4925 ± 6 Å3 |
Cell temperature | 293 ± 2 K |
Ambient diffraction temperature | 293 ± 2 K |
Number of distinct elements | 6 |
Space group number | 14 |
Hermann-Mauguin space group symbol | P 1 21/n 1 |
Hall space group symbol | -P 2yn |
Residual factor for all reflections | 0.3055 |
Residual factor for significantly intense reflections | 0.0774 |
Weighted residual factors for significantly intense reflections | 0.1136 |
Weighted residual factors for all reflections included in the refinement | 0.1785 |
Goodness-of-fit parameter for all reflections included in the refinement | 0.826 |
Diffraction radiation wavelength | 0.71073 Å |
Diffraction radiation type | MoKα |