Information card for entry 7035237
Formula | C38 H28 Hf P4 S6 |
Calculated formula | C38 H28 Hf P4 S6 |
SMILES | [Hf]123456([C]7([P@](c8ccccc8)(c8ccccc8[P@@]7(c7ccccc7)=[S]6)=[S]5)=[S]1)[C]1([P@@](c5ccccc5)(c5ccccc5[P@]1(c1ccccc1)=[S]2)=[S]3)=[S]4 |
Title of publication | Instability of metal 1,3-benzodi(thiophosphinoyl)methandiide complexes: formation of hafnium, tin and zirconium complexes of 1,3-benzodi(thiophosphinoyl)thioketone dianionic ligand [1,3-C6H4(PhPS)2CS](2.). |
Authors of publication | Yang, Ya-Xiu; Li, Yongxin; Ganguly, Rakesh; So, Cheuk-Wai |
Journal of publication | Dalton transactions (Cambridge, England : 2003) |
Year of publication | 2015 |
Journal volume | 44 |
Journal issue | 28 |
Pages of publication | 12633 - 12639 |
a | 12.6474 ± 0.0002 Å |
b | 20.407 ± 0.0003 Å |
c | 15.6269 ± 0.0002 Å |
α | 90° |
β | 113.055 ± 0.001° |
γ | 90° |
Cell volume | 3711.1 ± 0.1 Å3 |
Cell temperature | 103 ± 2 K |
Ambient diffraction temperature | 103 ± 2 K |
Number of distinct elements | 5 |
Space group number | 14 |
Hermann-Mauguin space group symbol | P 1 21/c 1 |
Hall space group symbol | -P 2ybc |
Residual factor for all reflections | 0.0238 |
Residual factor for significantly intense reflections | 0.021 |
Weighted residual factors for significantly intense reflections | 0.0485 |
Weighted residual factors for all reflections included in the refinement | 0.0497 |
Goodness-of-fit parameter for all reflections included in the refinement | 1.131 |
Diffraction radiation wavelength | 0.71073 Å |
Diffraction radiation type | MoKα |