Information card for entry 7035239
Formula | C53 H49 Hf N P4 S5 |
Calculated formula | C53 H49 Hf N P4 S5 |
Title of publication | Instability of metal 1,3-benzodi(thiophosphinoyl)methandiide complexes: formation of hafnium, tin and zirconium complexes of 1,3-benzodi(thiophosphinoyl)thioketone dianionic ligand [1,3-C6H4(PhPS)2CS](2.). |
Authors of publication | Yang, Ya-Xiu; Li, Yongxin; Ganguly, Rakesh; So, Cheuk-Wai |
Journal of publication | Dalton transactions (Cambridge, England : 2003) |
Year of publication | 2015 |
Journal volume | 44 |
Journal issue | 28 |
Pages of publication | 12633 - 12639 |
a | 10.2767 ± 0.0004 Å |
b | 14.8249 ± 0.0006 Å |
c | 16.7593 ± 0.0007 Å |
α | 82.255 ± 0.003° |
β | 85.97 ± 0.002° |
γ | 86.652 ± 0.002° |
Cell volume | 2520.66 ± 0.18 Å3 |
Cell temperature | 103 ± 2 K |
Ambient diffraction temperature | 103 ± 2 K |
Number of distinct elements | 6 |
Space group number | 2 |
Hermann-Mauguin space group symbol | P -1 |
Hall space group symbol | -P 1 |
Residual factor for all reflections | 0.1054 |
Residual factor for significantly intense reflections | 0.0587 |
Weighted residual factors for significantly intense reflections | 0.1029 |
Weighted residual factors for all reflections included in the refinement | 0.12 |
Goodness-of-fit parameter for all reflections included in the refinement | 1.027 |
Diffraction radiation wavelength | 0.71073 Å |
Diffraction radiation type | MoKα |