Information card for entry 7035240
Formula | C53 H49 N P4 S5 Zr |
Calculated formula | C53 H49 N P4 S5 Zr |
Title of publication | Instability of metal 1,3-benzodi(thiophosphinoyl)methandiide complexes: formation of hafnium, tin and zirconium complexes of 1,3-benzodi(thiophosphinoyl)thioketone dianionic ligand [1,3-C6H4(PhPS)2CS](2.). |
Authors of publication | Yang, Ya-Xiu; Li, Yongxin; Ganguly, Rakesh; So, Cheuk-Wai |
Journal of publication | Dalton transactions (Cambridge, England : 2003) |
Year of publication | 2015 |
Journal volume | 44 |
Journal issue | 28 |
Pages of publication | 12633 - 12639 |
a | 10.2451 ± 0.0002 Å |
b | 14.8428 ± 0.0003 Å |
c | 16.7675 ± 0.0003 Å |
α | 82.314 ± 0.001° |
β | 86.189 ± 0.001° |
γ | 86.69 ± 0.001° |
Cell volume | 2518.19 ± 0.08 Å3 |
Cell temperature | 103 ± 2 K |
Ambient diffraction temperature | 103 ± 2 K |
Number of distinct elements | 6 |
Space group number | 2 |
Hermann-Mauguin space group symbol | P -1 |
Hall space group symbol | -P 1 |
Residual factor for all reflections | 0.0644 |
Residual factor for significantly intense reflections | 0.043 |
Weighted residual factors for significantly intense reflections | 0.0943 |
Weighted residual factors for all reflections included in the refinement | 0.1044 |
Goodness-of-fit parameter for all reflections included in the refinement | 1.014 |
Diffraction radiation wavelength | 0.71073 Å |
Diffraction radiation type | MoKα |