Information card for entry 7035247
Formula | C30 H27 Ce Cl N5 O14 |
Calculated formula | C30 H27 Ce Cl N5 O14 |
Title of publication | Microwave-assisted large scale synthesis of lanthanide metal-organic frameworks (Ln-MOFs), having a preferred conformation and photoluminescence properties. |
Authors of publication | Bag, Partha Pratim; Wang, Xu-Sheng; Cao, Rong |
Journal of publication | Dalton transactions (Cambridge, England : 2003) |
Year of publication | 2015 |
Journal volume | 44 |
Journal issue | 26 |
Pages of publication | 11954 - 11962 |
a | 9.5251 ± 0.0003 Å |
b | 12.5605 ± 0.0004 Å |
c | 18.9231 ± 0.0006 Å |
α | 106.077 ± 0.003° |
β | 98.874 ± 0.003° |
γ | 100.643 ± 0.003° |
Cell volume | 2086.81 ± 0.13 Å3 |
Cell temperature | 100 ± 2 K |
Ambient diffraction temperature | 100 ± 2 K |
Number of distinct elements | 6 |
Space group number | 2 |
Hermann-Mauguin space group symbol | P -1 |
Hall space group symbol | -P 1 |
Residual factor for all reflections | 0.0608 |
Residual factor for significantly intense reflections | 0.0582 |
Weighted residual factors for significantly intense reflections | 0.1652 |
Weighted residual factors for all reflections included in the refinement | 0.1698 |
Goodness-of-fit parameter for all reflections included in the refinement | 1.074 |
Diffraction radiation wavelength | 1.54184 Å |
Diffraction radiation type | CuKα |