Information card for entry 7035248
Formula | C30 H27 Cl N5 O14 Pr |
Calculated formula | C30 H27 Cl N5 O14 Pr |
Title of publication | Microwave-assisted large scale synthesis of lanthanide metal-organic frameworks (Ln-MOFs), having a preferred conformation and photoluminescence properties. |
Authors of publication | Bag, Partha Pratim; Wang, Xu-Sheng; Cao, Rong |
Journal of publication | Dalton transactions (Cambridge, England : 2003) |
Year of publication | 2015 |
Journal volume | 44 |
Journal issue | 26 |
Pages of publication | 11954 - 11962 |
a | 9.53 ± 0.0003 Å |
b | 12.5401 ± 0.0004 Å |
c | 18.8719 ± 0.0006 Å |
α | 105.932 ± 0.003° |
β | 98.86 ± 0.002° |
γ | 100.482 ± 0.002° |
Cell volume | 2082.3 ± 0.12 Å3 |
Cell temperature | 100 ± 2 K |
Ambient diffraction temperature | 100 ± 2 K |
Number of distinct elements | 6 |
Space group number | 2 |
Hermann-Mauguin space group symbol | P -1 |
Hall space group symbol | -P 1 |
Residual factor for all reflections | 0.0596 |
Residual factor for significantly intense reflections | 0.0559 |
Weighted residual factors for significantly intense reflections | 0.1593 |
Weighted residual factors for all reflections included in the refinement | 0.1637 |
Goodness-of-fit parameter for all reflections included in the refinement | 1.083 |
Diffraction radiation wavelength | 1.54184 Å |
Diffraction radiation type | CuKα |