Information card for entry 7035250
Formula | C30 H27 Cl Eu N5 O14 |
Calculated formula | C30 H27 Cl Eu N5 O14 |
Title of publication | Microwave-assisted large scale synthesis of lanthanide metal-organic frameworks (Ln-MOFs), having a preferred conformation and photoluminescence properties. |
Authors of publication | Bag, Partha Pratim; Wang, Xu-Sheng; Cao, Rong |
Journal of publication | Dalton transactions (Cambridge, England : 2003) |
Year of publication | 2015 |
Journal volume | 44 |
Journal issue | 26 |
Pages of publication | 11954 - 11962 |
a | 9.4977 ± 0.0003 Å |
b | 12.627 ± 0.0004 Å |
c | 18.7072 ± 0.0004 Å |
α | 106.096 ± 0.002° |
β | 98.452 ± 0.002° |
γ | 100.275 ± 0.002° |
Cell volume | 2074.7 ± 0.11 Å3 |
Cell temperature | 100 ± 2 K |
Ambient diffraction temperature | 100 ± 2 K |
Number of distinct elements | 6 |
Space group number | 2 |
Hermann-Mauguin space group symbol | P -1 |
Hall space group symbol | -P 1 |
Residual factor for all reflections | 0.0864 |
Residual factor for significantly intense reflections | 0.0847 |
Weighted residual factors for significantly intense reflections | 0.2217 |
Weighted residual factors for all reflections included in the refinement | 0.227 |
Goodness-of-fit parameter for all reflections included in the refinement | 1.029 |
Diffraction radiation wavelength | 1.54184 Å |
Diffraction radiation type | CuKα |