Information card for entry 7035251
Formula | C30 H27 Cl N5 O14 Tb |
Calculated formula | C30 H27 Cl N5 O14 Tb |
Title of publication | Microwave-assisted large scale synthesis of lanthanide metal-organic frameworks (Ln-MOFs), having a preferred conformation and photoluminescence properties. |
Authors of publication | Bag, Partha Pratim; Wang, Xu-Sheng; Cao, Rong |
Journal of publication | Dalton transactions (Cambridge, England : 2003) |
Year of publication | 2015 |
Journal volume | 44 |
Journal issue | 26 |
Pages of publication | 11954 - 11962 |
a | 9.5307 ± 0.0001 Å |
b | 12.7016 ± 0.0003 Å |
c | 18.8199 ± 0.0003 Å |
α | 106.349 ± 0.002° |
β | 98.629 ± 0.001° |
γ | 100.06 ± 0.002° |
Cell volume | 2104.13 ± 0.07 Å3 |
Cell temperature | 100 ± 2 K |
Ambient diffraction temperature | 100 ± 2 K |
Number of distinct elements | 6 |
Space group number | 2 |
Hermann-Mauguin space group symbol | P -1 |
Hall space group symbol | -P 1 |
Residual factor for all reflections | 0.0675 |
Residual factor for significantly intense reflections | 0.0622 |
Weighted residual factors for significantly intense reflections | 0.1771 |
Weighted residual factors for all reflections included in the refinement | 0.1828 |
Goodness-of-fit parameter for all reflections included in the refinement | 1.091 |
Diffraction radiation wavelength | 0.71073 Å |
Diffraction radiation type | MoKα |