Information card for entry 7035252
Formula | C30 H27 Cl Dy N5 O14 |
Calculated formula | C30 H27 Cl Dy N5 O14 |
Title of publication | Microwave-assisted large scale synthesis of lanthanide metal-organic frameworks (Ln-MOFs), having a preferred conformation and photoluminescence properties. |
Authors of publication | Bag, Partha Pratim; Wang, Xu-Sheng; Cao, Rong |
Journal of publication | Dalton transactions (Cambridge, England : 2003) |
Year of publication | 2015 |
Journal volume | 44 |
Journal issue | 26 |
Pages of publication | 11954 - 11962 |
a | 9.4727 ± 0.0002 Å |
b | 12.652 ± 0.0004 Å |
c | 18.6017 ± 0.0006 Å |
α | 106.106 ± 0.003° |
β | 98.088 ± 0.002° |
γ | 100.255 ± 0.002° |
Cell volume | 2064.63 ± 0.11 Å3 |
Cell temperature | 100 ± 2 K |
Ambient diffraction temperature | 100 ± 2 K |
Number of distinct elements | 6 |
Space group number | 2 |
Hermann-Mauguin space group symbol | P -1 |
Hall space group symbol | -P 1 |
Residual factor for all reflections | 0.0731 |
Residual factor for significantly intense reflections | 0.0714 |
Weighted residual factors for significantly intense reflections | 0.193 |
Weighted residual factors for all reflections included in the refinement | 0.1965 |
Goodness-of-fit parameter for all reflections included in the refinement | 1.062 |
Diffraction radiation wavelength | 1.54184 Å |
Diffraction radiation type | CuKα |