Information card for entry 7035259
Formula | C84 H80 Al2 N2 O6 |
Calculated formula | C84 H80 Al2 N2 O6 |
Title of publication | Aluminum complexes based on pyridine substituted alcohols: synthesis, structure, and catalytic application in ROP. |
Authors of publication | Kireenko, Marina M.; Kuchuk, Ekaterina A.; Zaitsev, Kirill V.; Tafeenko, Viktor A.; Oprunenko, Yuri F.; Churakov, Andrei V.; Lermontova, Elmira Kh; Zaitseva, Galina S.; Karlov, Sergey S. |
Journal of publication | Dalton transactions (Cambridge, England : 2003) |
Year of publication | 2015 |
Journal volume | 44 |
Journal issue | 26 |
Pages of publication | 11963 - 11976 |
a | 10.4452 ± 0.0019 Å |
b | 18.143 ± 0.003 Å |
c | 18.099 ± 0.003 Å |
α | 90° |
β | 97.931 ± 0.003° |
γ | 90° |
Cell volume | 3397.1 ± 1 Å3 |
Cell temperature | 150 ± 2 K |
Ambient diffraction temperature | 150 ± 2 K |
Number of distinct elements | 5 |
Space group number | 14 |
Hermann-Mauguin space group symbol | P 1 21/c 1 |
Hall space group symbol | -P 2ybc |
Residual factor for all reflections | 0.1266 |
Residual factor for significantly intense reflections | 0.0817 |
Weighted residual factors for significantly intense reflections | 0.2206 |
Weighted residual factors for all reflections included in the refinement | 0.2494 |
Goodness-of-fit parameter for all reflections included in the refinement | 1.035 |
Diffraction radiation wavelength | 0.71073 Å |
Diffraction radiation type | MoKα |