Information card for entry 7035260
Formula | C64 H49 Al Cl6 N2 O4 |
Calculated formula | C64 H49 Al Cl6 N2 O4 |
Title of publication | Aluminum complexes based on pyridine substituted alcohols: synthesis, structure, and catalytic application in ROP. |
Authors of publication | Kireenko, Marina M.; Kuchuk, Ekaterina A.; Zaitsev, Kirill V.; Tafeenko, Viktor A.; Oprunenko, Yuri F.; Churakov, Andrei V.; Lermontova, Elmira Kh; Zaitseva, Galina S.; Karlov, Sergey S. |
Journal of publication | Dalton transactions (Cambridge, England : 2003) |
Year of publication | 2015 |
Journal volume | 44 |
Journal issue | 26 |
Pages of publication | 11963 - 11976 |
a | 13.2405 ± 0.0006 Å |
b | 13.2544 ± 0.0006 Å |
c | 16.8269 ± 0.0008 Å |
α | 98.855 ± 0.004° |
β | 106.372 ± 0.004° |
γ | 95.552 ± 0.004° |
Cell volume | 2768.8 ± 0.2 Å3 |
Cell temperature | 296 ± 2 K |
Ambient diffraction temperature | 296 ± 2 K |
Number of distinct elements | 6 |
Space group number | 2 |
Hermann-Mauguin space group symbol | P -1 |
Hall space group symbol | -P 1 |
Residual factor for all reflections | 0.1927 |
Residual factor for significantly intense reflections | 0.0901 |
Weighted residual factors for significantly intense reflections | 0.2187 |
Weighted residual factors for all reflections included in the refinement | 0.2522 |
Goodness-of-fit parameter for all reflections included in the refinement | 0.992 |
Diffraction radiation wavelength | 1.54186 Å |
Diffraction radiation type | CuKα |