Information card for entry 7035302
Formula | C27 H16 Cl4 F6 N2 Zn |
Calculated formula | C27 H16 Cl4 F6 N2 Zn |
Title of publication | Photophysical tuning of the aggregation-induced emission of a series of para-substituted aryl bis(imino)acenaphthene zinc complexes. |
Authors of publication | Evans, Daniel A.; Lee, Lucia Myongwon; Vargas-Baca, Ignacio; Cowley, Alan H. |
Journal of publication | Dalton transactions (Cambridge, England : 2003) |
Year of publication | 2015 |
Journal volume | 44 |
Journal issue | 26 |
Pages of publication | 11984 - 11996 |
a | 13.7395 ± 0.0005 Å |
b | 11.9489 ± 0.0003 Å |
c | 17.6137 ± 0.0005 Å |
α | 90° |
β | 111.023 ± 0.004° |
γ | 90° |
Cell volume | 2699.19 ± 0.16 Å3 |
Cell temperature | 100 ± 2 K |
Ambient diffraction temperature | 100 ± 2 K |
Number of distinct elements | 6 |
Space group number | 14 |
Hermann-Mauguin space group symbol | P 1 21/c 1 |
Hall space group symbol | -P 2ybc |
Residual factor for all reflections | 0.0458 |
Residual factor for significantly intense reflections | 0.0415 |
Weighted residual factors for significantly intense reflections | 0.111 |
Weighted residual factors for all reflections included in the refinement | 0.116 |
Goodness-of-fit parameter for all reflections included in the refinement | 0.98 |
Diffraction radiation wavelength | 1.54184 Å |
Diffraction radiation type | CuKα |