Information card for entry 7035303
Formula | C195 H190.5 Gd6 Mn6 N14.5 O57 |
Calculated formula | C195 H190.5 Gd6 Mn6 N14.5 O57 |
Title of publication | Dodecanuclear [MnLn] species: synthesis, structures and characterization of magnetic relaxation phenomena. |
Authors of publication | Tziotzi, Thomais G.; Tzimopoulos, Demetrios I.; Lis, Tadeusz; Inglis, Ross; Milios, Constantinos J. |
Journal of publication | Dalton transactions (Cambridge, England : 2003) |
Year of publication | 2015 |
Journal volume | 44 |
Journal issue | 26 |
Pages of publication | 11696 - 11699 |
a | 18.252 ± 0.006 Å |
b | 19.702 ± 0.007 Å |
c | 31.519 ± 0.01 Å |
α | 82.74 ± 0.04° |
β | 78.67 ± 0.04° |
γ | 65.87 ± 0.04° |
Cell volume | 10129 ± 7 Å3 |
Cell temperature | 80 ± 2 K |
Ambient diffraction temperature | 80 ± 2 K |
Number of distinct elements | 6 |
Space group number | 2 |
Hermann-Mauguin space group symbol | P -1 |
Hall space group symbol | -P 1 |
Residual factor for all reflections | 0.2324 |
Residual factor for significantly intense reflections | 0.11 |
Weighted residual factors for significantly intense reflections | 0.2206 |
Weighted residual factors for all reflections included in the refinement | 0.2907 |
Goodness-of-fit parameter for all reflections included in the refinement | 1.047 |
Diffraction radiation wavelength | 0.71073 Å |
Diffraction radiation type | MoKα |