Information card for entry 7035328
Formula | C20 H37 N4 O4 Sb |
Calculated formula | C20 H37 N4 O4 Sb |
SMILES | c1(c(cccc1CN1CCN(CC1)C)CN1CCN(CC1)C)[Sb]1OCCO1.O.O |
Title of publication | A general route to monoorganopnicogen(iii) (M = Sb, Bi) compounds with a pincer (N,C,N) group and oxo ligands. |
Authors of publication | Strîmb, Gabriela; Pöllnitz, Alpár; Raţ, Ciprian I; Silvestru, Cristian |
Journal of publication | Dalton transactions (Cambridge, England : 2003) |
Year of publication | 2015 |
Journal volume | 44 |
Journal issue | 21 |
Pages of publication | 9927 - 9942 |
a | 12.626 ± 0.003 Å |
b | 12.291 ± 0.003 Å |
c | 15.792 ± 0.003 Å |
α | 90° |
β | 99.53 ± 0.03° |
γ | 90° |
Cell volume | 2416.9 ± 1 Å3 |
Cell temperature | 293 ± 2 K |
Ambient diffraction temperature | 293 ± 2 K |
Number of distinct elements | 5 |
Space group number | 14 |
Hermann-Mauguin space group symbol | P 1 21/n 1 |
Hall space group symbol | -P 2yn |
Residual factor for all reflections | 0.1519 |
Residual factor for significantly intense reflections | 0.1086 |
Weighted residual factors for significantly intense reflections | 0.2069 |
Weighted residual factors for all reflections included in the refinement | 0.2261 |
Goodness-of-fit parameter for all reflections included in the refinement | 1.192 |
Diffraction radiation probe | x-ray |
Diffraction radiation wavelength | 0.71073 Å |
Diffraction radiation type | MoKα |