Information card for entry 7035327
Formula | C20 H31 N4 O5 Sb |
Calculated formula | C20 H31 N4 O5 Sb |
SMILES | c12c3cccc1C[N]1(CCN(CC1)C)[Sb]12([N]2(C3)CCN(CC2)C)OC(=O)C(=O)O1.O |
Title of publication | A general route to monoorganopnicogen(iii) (M = Sb, Bi) compounds with a pincer (N,C,N) group and oxo ligands. |
Authors of publication | Strîmb, Gabriela; Pöllnitz, Alpár; Raţ, Ciprian I; Silvestru, Cristian |
Journal of publication | Dalton transactions (Cambridge, England : 2003) |
Year of publication | 2015 |
Journal volume | 44 |
Journal issue | 21 |
Pages of publication | 9927 - 9942 |
a | 9.0558 ± 0.0019 Å |
b | 17.283 ± 0.004 Å |
c | 16.433 ± 0.003 Å |
α | 90° |
β | 105.629 ± 0.004° |
γ | 90° |
Cell volume | 2476.9 ± 0.9 Å3 |
Cell temperature | 297 ± 2 K |
Ambient diffraction temperature | 297 ± 2 K |
Number of distinct elements | 5 |
Space group number | 14 |
Hermann-Mauguin space group symbol | P 1 21/c 1 |
Hall space group symbol | -P 2ybc |
Residual factor for all reflections | 0.0564 |
Residual factor for significantly intense reflections | 0.0426 |
Weighted residual factors for significantly intense reflections | 0.0917 |
Weighted residual factors for all reflections included in the refinement | 0.0973 |
Goodness-of-fit parameter for all reflections included in the refinement | 1.049 |
Diffraction radiation probe | x-ray |
Diffraction radiation wavelength | 0.71073 Å |
Diffraction radiation type | MoKα |