Information card for entry 7035332
Formula | C24 H33 Bi N4 O2 |
Calculated formula | C24 H33 Bi N4 O2 |
SMILES | c12c3cccc1C[N]1(CCN(CC1)C)[Bi]12([N]2(C3)CCN(CC2)C)Oc2c(cccc2)O1 |
Title of publication | A general route to monoorganopnicogen(iii) (M = Sb, Bi) compounds with a pincer (N,C,N) group and oxo ligands. |
Authors of publication | Strîmb, Gabriela; Pöllnitz, Alpár; Raţ, Ciprian I; Silvestru, Cristian |
Journal of publication | Dalton transactions (Cambridge, England : 2003) |
Year of publication | 2015 |
Journal volume | 44 |
Journal issue | 21 |
Pages of publication | 9927 - 9942 |
a | 9.8126 ± 0.0009 Å |
b | 10.1505 ± 0.0009 Å |
c | 15.7304 ± 0.0014 Å |
α | 82.242 ± 0.002° |
β | 77.035 ± 0.002° |
γ | 64.012 ± 0.001° |
Cell volume | 1371.3 ± 0.2 Å3 |
Cell temperature | 295 ± 2 K |
Ambient diffraction temperature | 295 ± 2 K |
Number of distinct elements | 5 |
Space group number | 2 |
Hermann-Mauguin space group symbol | P -1 |
Hall space group symbol | -P 1 |
Residual factor for all reflections | 0.0426 |
Residual factor for significantly intense reflections | 0.0329 |
Weighted residual factors for significantly intense reflections | 0.0675 |
Weighted residual factors for all reflections included in the refinement | 0.0742 |
Goodness-of-fit parameter for all reflections included in the refinement | 1.013 |
Diffraction radiation probe | x-ray |
Diffraction radiation wavelength | 0.71073 Å |
Diffraction radiation type | MoKα |