Information card for entry 7035333
Formula | C181.75 H183 Cl9.5 N24.5 Ni4 O32 S12 |
Calculated formula | C181.75 H182.985 Cl9.5 N24.5 Ni4 O32 S12 |
Title of publication | Metallosupramolecular Ni2L3 and Ni4L6 complexes of bis-bidentate pyridine-containing ligands: X-ray structures and catalytic proton reduction. |
Authors of publication | Tsang, Chui-Shan; Chen, Lingjing; Li, Lu-Wei; Yiu, Shek-Man; Lau, Tai-Chu; Kwong, Hoi-Lun |
Journal of publication | Dalton transactions (Cambridge, England : 2003) |
Year of publication | 2015 |
Journal volume | 44 |
Journal issue | 29 |
Pages of publication | 13087 - 13092 |
a | 26.2992 ± 0.0004 Å |
b | 26.2992 ± 0.0004 Å |
c | 19.8472 ± 0.0005 Å |
α | 90° |
β | 90° |
γ | 120° |
Cell volume | 11888.2 ± 0.4 Å3 |
Cell temperature | 173 ± 2 K |
Ambient diffraction temperature | 173 ± 2 K |
Number of distinct elements | 7 |
Space group number | 143 |
Hermann-Mauguin space group symbol | P 3 |
Hall space group symbol | P 3 |
Residual factor for all reflections | 0.0623 |
Residual factor for significantly intense reflections | 0.0553 |
Weighted residual factors for significantly intense reflections | 0.148 |
Weighted residual factors for all reflections included in the refinement | 0.1527 |
Goodness-of-fit parameter for all reflections included in the refinement | 1.006 |
Diffraction radiation wavelength | 1.54184 Å |
Diffraction radiation type | CUKα |