Information card for entry 7035341
Formula | C35 H70 Mo18 N12 O79 P6 Sr Zn |
Calculated formula | C35 H70 Mo18 N12 O79 P6 Sr Zn |
Title of publication | Assembly of a basket-like {Sr ⊂ P6Mo18O73} cage from 0D dimmer to 2D network and its photo-/electro-catalytic properties. |
Authors of publication | Zhang, He; Lv, Jing-Hua; Yu, Kai; Wang, Chun-Mei; Wang, Chun-Xiao; Sun, Di; Zhou, Bai-Bin |
Journal of publication | Dalton transactions (Cambridge, England : 2003) |
Year of publication | 2015 |
Journal volume | 44 |
Journal issue | 28 |
Pages of publication | 12839 - 12851 |
a | 21.756 ± 0.004 Å |
b | 29.059 ± 0.005 Å |
c | 31.149 ± 0.006 Å |
α | 90° |
β | 92.594 ± 0.004° |
γ | 90° |
Cell volume | 19672 ± 6 Å3 |
Cell temperature | 298 ± 2 K |
Ambient diffraction temperature | 298 ± 2 K |
Number of distinct elements | 8 |
Space group number | 15 |
Hermann-Mauguin space group symbol | C 1 2/c 1 |
Hall space group symbol | -C 2yc |
Residual factor for all reflections | 0.0826 |
Residual factor for significantly intense reflections | 0.064 |
Weighted residual factors for significantly intense reflections | 0.1076 |
Weighted residual factors for all reflections included in the refinement | 0.1138 |
Goodness-of-fit parameter for all reflections included in the refinement | 1.032 |
Diffraction radiation wavelength | 0.71073 Å |
Diffraction radiation type | MoKα |