Information card for entry 7035342
Formula | C10 H32 Cu2 Mo18 N6 O79 P6 Sr |
Calculated formula | C10 H32 Cu2 Mo18 N6 O79 P6 Sr |
Title of publication | Assembly of a basket-like {Sr ⊂ P6Mo18O73} cage from 0D dimmer to 2D network and its photo-/electro-catalytic properties. |
Authors of publication | Zhang, He; Lv, Jing-Hua; Yu, Kai; Wang, Chun-Mei; Wang, Chun-Xiao; Sun, Di; Zhou, Bai-Bin |
Journal of publication | Dalton transactions (Cambridge, England : 2003) |
Year of publication | 2015 |
Journal volume | 44 |
Journal issue | 28 |
Pages of publication | 12839 - 12851 |
a | 32.532 ± 0.003 Å |
b | 21.8874 ± 0.0016 Å |
c | 12.3247 ± 0.0009 Å |
α | 90° |
β | 90° |
γ | 90° |
Cell volume | 8775.7 ± 1.2 Å3 |
Cell temperature | 298 ± 2 K |
Ambient diffraction temperature | 298 ± 2 K |
Number of distinct elements | 8 |
Space group number | 62 |
Hermann-Mauguin space group symbol | P n m a |
Hall space group symbol | -P 2ac 2n |
Residual factor for all reflections | 0.0867 |
Residual factor for significantly intense reflections | 0.0608 |
Weighted residual factors for significantly intense reflections | 0.1043 |
Weighted residual factors for all reflections included in the refinement | 0.1118 |
Goodness-of-fit parameter for all reflections included in the refinement | 1.047 |
Diffraction radiation wavelength | 0.71073 Å |
Diffraction radiation type | MoKα |