Information card for entry 7035344
Formula | C36 H68 Co Mo18 N12 O77 P6 Sr |
Calculated formula | C36 H68 Co Mo18 N12 O77 P6 Sr |
Title of publication | Assembly of a basket-like {Sr ⊂ P6Mo18O73} cage from 0D dimmer to 2D network and its photo-/electro-catalytic properties. |
Authors of publication | Zhang, He; Lv, Jing-Hua; Yu, Kai; Wang, Chun-Mei; Wang, Chun-Xiao; Sun, Di; Zhou, Bai-Bin |
Journal of publication | Dalton transactions (Cambridge, England : 2003) |
Year of publication | 2015 |
Journal volume | 44 |
Journal issue | 28 |
Pages of publication | 12839 - 12851 |
a | 16.69 ± 0.004 Å |
b | 13.887 ± 0.003 Å |
c | 21.799 ± 0.005 Å |
α | 90° |
β | 104.659 ± 0.004° |
γ | 90° |
Cell volume | 4888 ± 1.9 Å3 |
Cell temperature | 298 ± 2 K |
Ambient diffraction temperature | 298 ± 2 K |
Number of distinct elements | 8 |
Space group number | 4 |
Hermann-Mauguin space group symbol | P 1 21 1 |
Hall space group symbol | P 2yb |
Residual factor for all reflections | 0.0504 |
Residual factor for significantly intense reflections | 0.0387 |
Weighted residual factors for significantly intense reflections | 0.091 |
Weighted residual factors for all reflections included in the refinement | 0.1022 |
Goodness-of-fit parameter for all reflections included in the refinement | 1.043 |
Diffraction radiation wavelength | 0.71073 Å |
Diffraction radiation type | MoKα |