Information card for entry 7035345
Formula | C36 H68 Mo18 N12 Ni O77 P6 Sr |
Calculated formula | C36 H68 Mo18 N12 Ni O77 P6 Sr |
Title of publication | Assembly of a basket-like {Sr ⊂ P6Mo18O73} cage from 0D dimmer to 2D network and its photo-/electro-catalytic properties. |
Authors of publication | Zhang, He; Lv, Jing-Hua; Yu, Kai; Wang, Chun-Mei; Wang, Chun-Xiao; Sun, Di; Zhou, Bai-Bin |
Journal of publication | Dalton transactions (Cambridge, England : 2003) |
Year of publication | 2015 |
Journal volume | 44 |
Journal issue | 28 |
Pages of publication | 12839 - 12851 |
a | 16.6067 ± 0.001 Å |
b | 13.7398 ± 0.0008 Å |
c | 21.5749 ± 0.0013 Å |
α | 90° |
β | 104.718 ± 0.001° |
γ | 90° |
Cell volume | 4761.3 ± 0.5 Å3 |
Cell temperature | 298 ± 2 K |
Ambient diffraction temperature | 298 ± 2 K |
Number of distinct elements | 8 |
Space group number | 4 |
Hermann-Mauguin space group symbol | P 1 21 1 |
Hall space group symbol | P 2yb |
Residual factor for all reflections | 0.0321 |
Residual factor for significantly intense reflections | 0.0288 |
Weighted residual factors for significantly intense reflections | 0.0721 |
Weighted residual factors for all reflections included in the refinement | 0.0801 |
Goodness-of-fit parameter for all reflections included in the refinement | 1.076 |
Diffraction radiation wavelength | 0.71073 Å |
Diffraction radiation type | MoKα |