Information card for entry 7035352
Formula | C19 H22 Cu Dy N5 O15 |
Calculated formula | C19 H20 Cu Dy N5 O15 |
SMILES | C[O]1c2cccc3c2[O]2[Cu]45([N](CC(C[N]4=C3)O)=Cc3cccc4c3[O]5[Dy]35612([O]4C)(ON(=[O]3)=O)(ON(=[O]5)=O)ON(=[O]6)=O)[OH2] |
Title of publication | Cu(ii)-Dy(iii) and Co(iii)-Dy(iii) based single molecule magnets with multiple slow magnetic relaxation processes in the Cu(ii)-Dy(iii) complex. |
Authors of publication | Dolai, Malay; Ali, Mahammad; Titiš, Ján; Boča, Roman |
Journal of publication | Dalton transactions (Cambridge, England : 2003) |
Year of publication | 2015 |
Journal volume | 44 |
Journal issue | 29 |
Pages of publication | 13242 - 13249 |
a | 9.0716 ± 0.0004 Å |
b | 28.5414 ± 0.0012 Å |
c | 10.2781 ± 0.0005 Å |
α | 90° |
β | 105.521 ± 0.005° |
γ | 90° |
Cell volume | 2564.1 ± 0.2 Å3 |
Cell temperature | 293 ± 2 K |
Ambient diffraction temperature | 293 ± 2 K |
Number of distinct elements | 6 |
Space group number | 14 |
Hermann-Mauguin space group symbol | P 1 21/c 1 |
Hall space group symbol | -P 2ybc |
Residual factor for all reflections | 0.0576 |
Residual factor for significantly intense reflections | 0.053 |
Weighted residual factors for significantly intense reflections | 0.1152 |
Weighted residual factors for all reflections included in the refinement | 0.1175 |
Goodness-of-fit parameter for all reflections included in the refinement | 1.18 |
Diffraction radiation wavelength | 0.71073 Å |
Diffraction radiation type | MoKα |