Information card for entry 7035353
Formula | C27 H44 Co Dy N2 O19 |
Calculated formula | C27 H38 Co Dy N2 O19 |
SMILES | [Dy]1234(OC(=O)C)([O]=C(O[Co]567([O]1c1c(cccc1[O]4C)C=[N]5CC(C[N]7=Cc1cccc([O]3C)c1[O]26)O)OC(=O)C)C)([OH2])([OH2])[OH2].O.O.O.O=C(C)[O-] |
Title of publication | Cu(ii)-Dy(iii) and Co(iii)-Dy(iii) based single molecule magnets with multiple slow magnetic relaxation processes in the Cu(ii)-Dy(iii) complex. |
Authors of publication | Dolai, Malay; Ali, Mahammad; Titiš, Ján; Boča, Roman |
Journal of publication | Dalton transactions (Cambridge, England : 2003) |
Year of publication | 2015 |
Journal volume | 44 |
Journal issue | 29 |
Pages of publication | 13242 - 13249 |
a | 11.1816 ± 0.0002 Å |
b | 20.7429 ± 0.0004 Å |
c | 15.4433 ± 0.0003 Å |
α | 90° |
β | 102.707 ± 0.001° |
γ | 90° |
Cell volume | 3494.17 ± 0.12 Å3 |
Cell temperature | 155 ± 2 K |
Ambient diffraction temperature | 155 ± 2 K |
Number of distinct elements | 6 |
Space group number | 14 |
Hermann-Mauguin space group symbol | P 1 21/c 1 |
Hall space group symbol | -P 2ybc |
Residual factor for all reflections | 0.0334 |
Residual factor for significantly intense reflections | 0.0277 |
Weighted residual factors for significantly intense reflections | 0.075 |
Weighted residual factors for all reflections included in the refinement | 0.0788 |
Goodness-of-fit parameter for all reflections included in the refinement | 1.026 |
Diffraction radiation wavelength | 0.71073 Å |
Diffraction radiation type | MoKα |